• 0

    posted a message on Too Many Items 1.8.9

    There's another bug:

    Using search bar could cause game freezing.

    Posted in: WIP Mods
  • 0

    posted a message on Too Many Items 1.8.9

    I've updated the old TooManyItems mod to 1.8.9.

    View the source and download on my github: github.com/HowardZHY/TooManyItems

    There's a Forge version and a MCP client. Build with MCP 918.

    All funcs should work fine.

    Known issue: you must press esc to exit inventory.

    Posted in: WIP Mods
  • 0

    posted a message on I can't join my server

    good luck.

    always check logs if there's something wrong

    Posted in: Java Edition Support
  • 1

    posted a message on I can't join my server

    make sure u have the correct ip and port. u might need to turn off ur Firewall

    Posted in: Java Edition Support
  • 0

    posted a message on XRay Mod (1.6.4 - 1.11) ( Vanilla/Forge/LiteLoader )

    I've found my xray v47.jar have a backdoor. There's a URLClassLoader in XrayForgeTweaker.

    Posted in: Minecraft Mods
  • 0

    posted a message on How to convert plugin into a mod??

    try MCreator, it can create mods that add items easily

    Posted in: Modification Development
  • 0

    posted a message on [1.5.2] Better than Wolves: Community Edition (v1.3.10b - June 22nd, 2022) - Minecraft Total Conversion

    Does BTW compatible with vanilla/bukkit servers?

    Posted in: Minecraft Mods
  • 0

    posted a message on [1.14] Chocapic13's Shaders

    Is there anyway to use this v7-v9 on 1.8.9 or ever 1.7.10 ?

    Posted in: Minecraft Mods
  • 0

    posted a message on XRay Mod (1.6.4 - 1.11) ( Vanilla/Forge/LiteLoader )

    is there a jar for 1.12.2 forge?

    Posted in: Minecraft Mods
  • 0

    posted a message on How to edit a mod code

    u can use JByte-Mod to edit some of the name strings

    Posted in: Modification Development
  • 0

    posted a message on Cannot find symbol Minecraft.func_xxx

    Starting Gradle Daemon...Gradle Daemon started in 9 s 315 msjava.net.ConnectException: Connection timed out: connect at java.net.DualStackPlainSocketImpl.connect0(Native Method) at java.net.DualStackPlainSocketImpl.socketConnect(DualStackPlainSocketImpl.java:75) at java.net.AbstractPlainSocketImpl.doConnect(AbstractPlainSocketImpl.java:476) at java.net.AbstractPlainSocketImpl.connectToAddress(AbstractPlainSocketImpl.java:218) at java.net.AbstractPlainSocketImpl.connect(AbstractPlainSocketImpl.java:200) at java.net.PlainSocketImpl.connect(PlainSocketImpl.java:162) at java.net.SocksSocketImpl.connect(SocksSocketImpl.java:394) at java.net.Socket.connect(Socket.java:606) at sun.security.ssl.SSLSocketImpl.connect(SSLSocketImpl.java:287) at sun.security.ssl.BaseSSLSocketImpl.connect(BaseSSLSocketImpl.java:173) at sun.net.NetworkClient.doConnect(NetworkClient.java:180) at sun.net.www.http.HttpClient.openServer(HttpClient.java:463) at sun.net.www.http.HttpClient.openServer(HttpClient.java:558) at sun.net.www.protocol.https.HttpsClient.<init>(HttpsClient.java:292) at sun.net.www.protocol.https.HttpsClient.New(HttpsClient.java:395) at sun.net.www.protocol.https.AbstractDelegateHttpsURLConnection.getNewHttpClient(AbstractDelegateHttpsURLConnection.java:203) at sun.net.www.protocol.http.HttpURLConnection.plainConnect0(HttpURLConnection.java:1167) at sun.net.www.protocol.http.HttpURLConnection.plainConnect(HttpURLConnection.java:1061) at sun.net.www.protocol.https.AbstractDelegateHttpsURLConnection.connect(AbstractDelegateHttpsURLConnection.java:189) at sun.net.www.protocol.https.HttpsURLConnectionImpl.connect(HttpsURLConnectionImpl.java:167) at net.minecraftforge.gradle.common.BasePlugin.getWithEtag(BasePlugin.java:651) at net.minecraftforge.gradle.common.BasePlugin.getRemoteJsons(BasePlugin.java:218) at net.minecraftforge.gradle.common.BasePlugin.apply(BasePlugin.java:172) at net.minecraftforge.gradle.common.BasePlugin.apply(BasePlugin.java:89) at org.gradle.api.internal.plugins.ImperativeOnlyPluginApplicator.applyImperative(ImperativeOnlyPluginApplicator.java:35) at org.gradle.api.internal.plugins.RuleBasedPluginApplicator.applyImperative(RuleBasedPluginApplicator.java:43) at org.gradle.api.internal.plugins.DefaultPluginManager.doApply(DefaultPluginManager.java:139) at org.gradle.api.internal.plugins.DefaultPluginManager.apply(DefaultPluginManager.java:112) at org.gradle.api.internal.plugins.DefaultObjectConfigurationAction.applyType(DefaultObjectConfigurationAction.java:113) at org.gradle.api.internal.plugins.DefaultObjectConfigurationAction.access$200(DefaultObjectConfigurationAction.java:36) at org.gradle.api.internal.plugins.DefaultObjectConfigurationAction$3.run(DefaultObjectConfigurationAction.java:80) at org.gradle.api.internal.plugins.DefaultObjectConfigurationAction.execute(DefaultObjectConfigurationAction.java:136) at org.gradle.api.internal.project.AbstractPluginAware.apply(AbstractPluginAware.java:44) at org.gradle.api.internal.project.ProjectScript.apply(ProjectScript.java:34) at org.gradle.api.Script$apply$0.callCurrent(Unknown Source) at org.codehaus.groovy.runtime.callsite.CallSiteArray.defaultCallCurrent(CallSiteArray.java:52) at org.codehaus.groovy.runtime.callsite.AbstractCallSite.callCurrent(AbstractCallSite.java:154) at org.codehaus.groovy.runtime.callsite.AbstractCallSite.callCurrent(AbstractCallSite.java:166) at build_8avy0ruxmgkvtt6pomogtqaj6.run(D:\1.8\forge-1.8.9-11.15.1.2318-1.8.9-mdk\build.gradle:15) at org.gradle.groovy.scripts.internal.DefaultScriptRunnerFactory$ScriptRunnerImpl.run(DefaultScriptRunnerFactory.java:90) at org.gradle.configuration.DefaultScriptPluginFactory$ScriptPluginImpl$2.run(DefaultScriptPluginFactory.java:176) at org.gradle.configuration.ProjectScriptTarget.addConfiguration(ProjectScriptTarget.java:77) at org.gradle.configuration.DefaultScriptPluginFactory$ScriptPluginImpl.apply(DefaultScriptPluginFactory.java:181) at org.gradle.configuration.project.BuildScriptProcessor.execute(BuildScriptProcessor.java:38) at org.gradle.configuration.project.BuildScriptProcessor.execute(BuildScriptProcessor.java:25) at org.gradle.configuration.project.ConfigureActionsProjectEvaluator.evaluate(ConfigureActionsProjectEvaluator.java:34) at org.gradle.configuration.project.LifecycleProjectEvaluator.evaluate(LifecycleProjectEvaluator.java:55) at org.gradle.api.internal.project.DefaultProject.evaluate(DefaultProject.java:573) at org.gradle.api.internal.project.DefaultProject.evaluate(DefaultProject.java:125) at org.gradle.execution.TaskPathProjectEvaluator.configureHierarchy(TaskPathProjectEvaluator.java:42) at org.gradle.configuration.DefaultBuildConfigurer.configure(DefaultBuildConfigurer.java:38) at org.gradle.initialization.DefaultGradleLauncher$2.run(DefaultGradleLauncher.java:151) at org.gradle.internal.Factories$1.create(Factories.java:22) at org.gradle.internal.progress.DefaultBuildOperationExecutor.run(DefaultBuildOperationExecutor.java:91) at org.gradle.internal.progress.DefaultBuildOperationExecutor.run(DefaultBuildOperationExecutor.java:53) at org.gradle.initialization.DefaultGradleLauncher.doBuildStages(DefaultGradleLauncher.java:148) at org.gradle.initialization.DefaultGradleLauncher.access$200(DefaultGradleLauncher.java:33) at org.gradle.initialization.DefaultGradleLauncher$1.create(DefaultGradleLauncher.java:112) at org.gradle.initialization.DefaultGradleLauncher$1.create(DefaultGradleLauncher.java:106) at org.gradle.internal.progress.DefaultBuildOperationExecutor.run(DefaultBuildOperationExecutor.java:91) at org.gradle.internal.progress.DefaultBuildOperationExecutor.run(DefaultBuildOperationExecutor.java:63) at org.gradle.initialization.DefaultGradleLauncher.doBuild(DefaultGradleLauncher.java:106) at org.gradle.initialization.DefaultGradleLauncher.run(DefaultGradleLauncher.java:92) at org.gradle.launcher.exec.GradleBuildController.run(GradleBuildController.java:66) at org.gradle.tooling.internal.provider.runner.BuildModelActionRunner.run(BuildModelActionRunner.java:46) at org.gradle.launcher.exec.ChainingBuildActionRunner.run(ChainingBuildActionRunner.java:35) at org.gradle.tooling.internal.provider.runner.SubscribableBuildActionRunner.run(SubscribableBuildActionRunner.java:58) at org.gradle.launcher.exec.ChainingBuildActionRunner.run(ChainingBuildActionRunner.java:35) at org.gradle.launcher.exec.InProcessBuildActionExecuter.execute(InProcessBuildActionExecuter.java:41) at org.gradle.launcher.exec.InProcessBuildActionExecuter.execute(InProcessBuildActionExecuter.java:26) at org.gradle.tooling.internal.provider.ContinuousBuildActionExecuter.execute(ContinuousBuildActionExecuter.java:79) at org.gradle.tooling.internal.provider.ContinuousBuildActionExecuter.execute(ContinuousBuildActionExecuter.java:51) at org.gradle.launcher.daemon.server.exec.ExecuteBuild.doBuild(ExecuteBuild.java:59) at org.gradle.launcher.daemon.server.exec.BuildCommandOnly.execute(BuildCommandOnly.java:36) at org.gradle.launcher.daemon.server.api.DaemonCommandExecution.proceed(DaemonCommandExecution.java:120) at org.gradle.launcher.daemon.server.exec.WatchForDisconnection.execute(WatchForDisconnection.java:47) at org.gradle.launcher.daemon.server.api.DaemonCommandExecution.proceed(DaemonCommandExecution.java:120) at org.gradle.launcher.daemon.server.exec.ResetDeprecationLogger.execute(ResetDeprecationLogger.java:26) at org.gradle.launcher.daemon.server.api.DaemonCommandExecution.proceed(DaemonCommandExecution.java:120) at org.gradle.launcher.daemon.server.exec.RequestStopIfSingleUsedDaemon.execute(RequestStopIfSingleUsedDaemon.java:34) at org.gradle.launcher.daemon.server.api.DaemonCommandExecution.proceed(DaemonCommandExecution.java:120) at org.gradle.launcher.daemon.server.exec.ForwardClientInput$2.call(ForwardClientInput.java:74) at org.gradle.launcher.daemon.server.exec.ForwardClientInput$2.call(ForwardClientInput.java:72) at org.gradle.util.Swapper.swap(Swapper.java:38) at org.gradle.launcher.daemon.server.exec.ForwardClientInput.execute(ForwardClientInput.java:72) at org.gradle.launcher.daemon.server.api.DaemonCommandExecution.proceed(DaemonCommandExecution.java:120) at org.gradle.launcher.daemon.server.exec.LogAndCheckHealth.execute(LogAndCheckHealth.java:55) at org.gradle.launcher.daemon.server.api.DaemonCommandExecution.proceed(DaemonCommandExecution.java:120) at org.gradle.launcher.daemon.server.exec.LogToClient.doBuild(LogToClient.java:60) at org.gradle.launcher.daemon.server.exec.BuildCommandOnly.execute(BuildCommandOnly.java:36) at org.gradle.launcher.daemon.server.api.DaemonCommandExecution.proceed(DaemonCommandExecution.java:120) at org.gradle.launcher.daemon.server.exec.EstablishBuildEnvironment.doBuild(EstablishBuildEnvironment.java:72) at org.gradle.launcher.daemon.server.exec.BuildCommandOnly.execute(BuildCommandOnly.java:36) at org.gradle.launcher.daemon.server.api.DaemonCommandExecution.proceed(DaemonCommandExecution.java:120) at org.gradle.launcher.daemon.server.exec.HintGCAfterBuild.execute(HintGCAfterBuild.java:44) at org.gradle.launcher.daemon.server.api.DaemonCommandExecution.proceed(DaemonCommandExecution.java:120) at org.gradle.launcher.daemon.server.exec.StartBuildOrRespondWithBusy$1.run(StartBuildOrRespondWithBusy.java:50) at org.gradle.launcher.daemon.server.DaemonStateCoordinator$1.run(DaemonStateCoordinator.java:293) at org.gradle.internal.concurrent.ExecutorPolicy$CatchAndRecordFailures.onExecute(ExecutorPolicy.java:54) at org.gradle.internal.concurrent.StoppableExecutorImpl$1.run(StoppableExecutorImpl.java:40) at java.util.concurrent.ThreadPoolExecutor.runWorker(ThreadPoolExecutor.java:1149) at java.util.concurrent.ThreadPoolExecutor$Worker.run(ThreadPoolExecutor.java:624) at java.lang.Thread.run(Thread.java:748)This mapping 'stable_20' was designed for MC 1.8.8! Use at your own peril.WARNING: You are using an unsupported version of ForgeGradle.Please consider upgrading to ForgeGradle 5 and helping in the efforts to get old versions working on the modern toolchain
    .See https://gist.github.com/TheCurle/fe7ad3ede188cbdd15c235cc75d52d4a for more info on contributing.################################################# ForgeGradle 2.1.3-g6a7c715 https://github.com/MinecraftForge/ForgeGradle ################################################# Powered by MCP unknown http://modcoderpack.com by: Searge, ProfMobius, Fesh0r, R4wk, ZeuX, IngisKahn, bspkrs #################################################:deobfCompileDummyTask:deobfProvidedDummyTask:sourceApiJava UP-TO-DATE:compileApiJava UP-TO-DATE:processApiResources UP-TO-DATE:apiClasses UP-TO-DATE:sourceMainJava UP-TO-DATE:compileJavawarning: [options] bootstrap class path not set in conjunction with -source 1.6D:\1.8\forge-1.8.9-11.15.1.2318-1.8.9-mdk\build\sources\main\java\com\reach\Reach.java:24: error: cannot find symbol protected Minecraft mc = Minecraft.func_71410_x(); ^ symbol: method func_71410_x() location: class MinecraftD:\1.8\forge-1.8.9-11.15.1.2318-1.8.9-mdk\build\sources\main\java\com\reach\Reach.java:44: error: cannot find symbol this.mc.field_71476_x = this.moving; ^ symbol: variable field_71476_x location: variable mc of type MinecraftD:\1.8\forge-1.8.9-11.15.1.2318-1.8.9-mdk\build\sources\main\java\com\reach\Reach.java:52: error: cannot find symbol if (this.mc.field_71441_e != null) { ^ symbol: variable field_71441_e location: variable mc of type MinecraftD:\1.8\forge-1.8.9-11.15.1.2318-1.8.9-mdk\build\sources\main\java\com\reach\Reach.java:63: error: cannot find symbol if (Minecraft.func_71410_x().func_175606_aa() != null && ^ symbol: method func_71410_x() location: class MinecraftD:\1.8\forge-1.8.9-11.15.1.2318-1.8.9-mdk\build\sources\main\java\com\reach\Reach.java:64: error: cannot find symbol (Minecraft.func_71410_x()).field_71441_e != null) { ^ symbol: method func_71410_x() location: class MinecraftD:\1.8\forge-1.8.9-11.15.1.2318-1.8.9-mdk\build\sources\main\java\com\reach\Reach.java:65: error: cannot find symbol (Minecraft.func_71410_x()).field_147125_j = null; ^ symbol: method func_71410_x() location: class MinecraftD:\1.8\forge-1.8.9-11.15.1.2318-1.8.9-mdk\build\sources\main\java\com\reach\Reach.java:67: error: cannot find symbol this.moving = Minecraft.func_71410_x().func_175606_aa().func_174822_a(d0, p_78473_1_); ^ symbol: method func_71410_x() location: class MinecraftD:\1.8\forge-1.8.9-11.15.1.2318-1.8.9-mdk\build\sources\main\java\com\reach\Reach.java:69: error: cannot find symbol Vec3 vec3 = Minecraft.func_71410_x().func_175606_aa().func_174824_e(p_78473_1_); ^ symbol: method func_71410_x() location: class MinecraftD:\1.8\forge-1.8.9-11.15.1.2318-1.8.9-mdk\build\sources\main\java\com\reach\Reach.java:71: error: cannot find symbol d1 = this.moving.field_72307_f.func_72438_d(vec3); ^ symbol: variable field_72307_f location: variable moving of type MovingObjectPositionD:\1.8\forge-1.8.9-11.15.1.2318-1.8.9-mdk\build\sources\main\java\com\reach\Reach.java:72: error: cannot find symbol Vec3 vec31 = Minecraft.func_71410_x().func_175606_aa().func_70676_i(p_78473_1_); ^ symbol: method func_71410_x() location: class MinecraftD:\1.8\forge-1.8.9-11.15.1.2318-1.8.9-mdk\build\sources\main\java\com\reach\Reach.java:73: error: cannot find symbol Vec3 vec32 = vec3.func_72441_c(vec31.field_72450_a * d0, vec31.field_72448_b * d0, vec31.field_72449_c * d0); ^ symbol: variable field_72450_a location: variable vec31 of type Vec3D:\1.8\forge-1.8.9-11.15.1.2318-1.8.9-mdk\build\sources\main\java\com\reach\Reach.java:73: error: cannot find symbol Vec3 vec32 = vec3.func_72441_c(vec31.field_72450_a * d0, vec31.field_72448_b * d0, vec31.field_72449_c * d0); ^ symbol: variable field_72448_b location: variable vec31 of type Vec3D:\1.8\forge-1.8.9-11.15.1.2318-1.8.9-mdk\build\sources\main\java\com\reach\Reach.java:73: error: cannot find symbol Vec3 vec32 = vec3.func_72441_c(vec31.field_72450_a * d0, vec31.field_72448_b * d0, vec31.field_72449_c * d0); ^ symbol: variable field_72449_c location: variable vec31 of type Vec3D:\1.8\forge-1.8.9-11.15.1.2318-1.8.9-mdk\build\sources\main\java\com\reach\Reach.java:78: error: cannot find symbol Minecraft.func_71410_x().func_175606_aa(), ^ symbol: method func_71410_x() location: class MinecraftD:\1.8\forge-1.8.9-11.15.1.2318-1.8.9-mdk\build\sources\main\java\com\reach\Reach.java:80: error: cannot find symbol .func_72321_a(vec31.field_72450_a * d0, vec31.field_72448_b * d0, vec31.field_72449_c * d0) ^ symbol: variable field_72450_a location: variable vec31 of type Vec3D:\1.8\forge-1.8.9-11.15.1.2318-1.8.9-mdk\build\sources\main\java\com\reach\Reach.java:80: error: cannot find symbol .func_72321_a(vec31.field_72450_a * d0, vec31.field_72448_b * d0, vec31.field_72449_c * d0) ^ symbol: variable field_72448_b location: variable vec31 of type Vec3D:\1.8\forge-1.8.9-11.15.1.2318-1.8.9-mdk\build\sources\main\java\com\reach\Reach.java:80: error: cannot find symbol .func_72321_a(vec31.field_72450_a * d0, vec31.field_72448_b * d0, vec31.field_72449_c * d0) ^ symbol: variable field_72449_c location: variable vec31 of type Vec3D:\1.8\forge-1.8.9-11.15.1.2318-1.8.9-mdk\build\sources\main\java\com\reach\Reach.java:79: error: cannot find symbol Minecraft.func_71410_x().func_175606_aa().func_174813_aQ() ^ symbol: method func_71410_x() location: class MinecraftD:\1.8\forge-1.8.9-11.15.1.2318-1.8.9-mdk\build\sources\main\java\com\reach\Reach.java:77: error: cannot find symbol List<Entity> list = (Minecraft.func_71410_x()).field_71441_e.func_72839_b( ^ symbol: method func_71410_x() location: class MinecraftD:\1.8\forge-1.8.9-11.15.1.2318-1.8.9-mdk\build\sources\main\java\com\reach\Reach.java:85: error: cannot find symbol if (entity.func_70067_L()) { ^ symbol: method func_70067_L() location: variable entity of type EntityD:\1.8\forge-1.8.9-11.15.1.2318-1.8.9-mdk\build\sources\main\java\com\reach\Reach.java:87: error: cannot find symbol AxisAlignedBB axisalignedbb = entity.func_174813_aQ().func_72314_b(f2, f2, f2); ^ symbol: method func_174813_aQ() location: variable entity of type EntityD:\1.8\forge-1.8.9-11.15.1.2318-1.8.9-mdk\build\sources\main\java\com\reach\Reach.java:88: error: cannot find symbol MovingObjectPosition movingobjectposition = axisalignedbb.func_72327_a(vec3, vec32); ^ symbol: method func_72327_a(Vec3,Vec3) location: variable axisalignedbb of type AxisAlignedBBD:\1.8\forge-1.8.9-11.15.1.2318-1.8.9-mdk\build\sources\main\java\com\reach\Reach.java:89: error: cannot find symbol if (axisalignedbb.func_72318_a(vec3)) { ^ symbol: method func_72318_a(Vec3) location: variable axisalignedbb of type AxisAlignedBBD:\1.8\forge-1.8.9-11.15.1.2318-1.8.9-mdk\build\sources\main\java\com\reach\Reach.java:92: error: cannot find symbol vec33 = (movingobjectposition == null) ? vec3 : movingobjectposition.field_72307_f; ^ symbol: variable field_72307_f location: variable movingobjectposition of type MovingObjectPositionD:\1.8\forge-1.8.9-11.15.1.2318-1.8.9-mdk\build\sources\main\java\com\reach\Reach.java:96: error: cannot find symbol double d3 = vec3.func_72438_d(movingobjectposition.field_72307_f); ^ symbol: variable field_72307_f location: variable movingobjectposition of type MovingObjectPositionD:\1.8\forge-1.8.9-11.15.1.2318-1.8.9-mdk\build\sources\main\java\com\reach\Reach.java:98: error: cannot find symbol if (entity == (Minecraft.func_71410_x().func_175606_aa()).field_70154_o && ^ symbol: method func_71410_x() location: class MinecraftD:\1.8\forge-1.8.9-11.15.1.2318-1.8.9-mdk\build\sources\main\java\com\reach\Reach.java:102: error: cannot find symbol vec33 = movingobjectposition.field_72307_f; ^ symbol: variable field_72307_f location: variable movingobjectposition of type MovingObjectPositionD:\1.8\forge-1.8.9-11.15.1.2318-1.8.9-mdk\build\sources\main\java\com\reach\Reach.java:106: error: cannot find symbol vec33 = movingobjectposition.field_72307_f; ^ symbol: variable field_72307_f location: variable movingobjectposition of type MovingObjectPositionD:\1.8\forge-1.8.9-11.15.1.2318-1.8.9-mdk\build\sources\main\java\com\reach\Reach.java:115: error: cannot find symbol (Minecraft.func_71410_x()).field_147125_j = this.pointedEntity; ^ symbol: method func_71410_x() location: class MinecraftNote: D:\1.8\forge-1.8.9-11.15.1.2318-1.8.9-mdk\build\sources\main\java\com\reach\Reach.java uses or overrides a deprecated API.Note: Recompile with -Xlint:deprecation for details.29 errors1 warning FAILED
    FAILURE: Build failed with an exception.
    * What went wrong:Execution failed for task ':compileJava'.> Compilation failed; see the compiler error output for details.
    * Try:Run with --stacktrace option to get the stack trace. Run with --info or --debug option to get more log output.
    BUILD FAILED

    Is there anything wrong with Forge Gradle ?

    Posted in: Modification Development
  • 0

    posted a message on Is there anyone who can rewrite Too Many Items?

    Now I've used MCP 910 to decompile TMI. But there are too many errors when recompiling it.

    Posted in: Requests / Ideas For Mods
  • 0

    posted a message on InfDev REBORN 1.12.2

    what will going on if I try to use this client to join a MP server

    Posted in: Mod Packs
  • 0

    posted a message on Is there anyone who can rewrite Too Many Items?

    I'v sent wotblitz / RedCDevHA a message on Reddit. IDK can he see or not

    Posted in: Requests / Ideas For Mods
  • To post a comment, please .